Habe alle Updates installieren lassen, jetzt wird das Passwort wieder akzeptiert.
Beiträge von overheat
-
-
Hallo Zusammen,
ich bin bei der Root Partition (20Gb), aufgrund von Speichermangels auf Ext4 umgestiegen.
Beim Start vom kommt jetzt wie gewöhnlich der Passwortmanager und fragt nach seinen Passwort.
Trotz korrekter Eingabe, wird die Eingabe zurückgewiesen.Wie kann ich das KWallet Passwort zurücksetzen?
Gruß
-
Danke Sauerland,
mit alien hatte ich es auch nochmal versucht, allerdings startete das installierte rpm dann nur mit Fehlermeldung.
Ich schließe dann mal dieses Thema.Gruß
overheat -
Habe mir die Makefile's im Hauptordner, als auch in den Unterordnern /src/ui/ und /src/editor/ angeschaut allerdings sehe ich dort nicht wo „addon“, „keymap“, „lib“ kopiert werden sollen.
Woran liegt es, das das Makefile mit make nicht korrekt durchläuft?
Hat jemand eine Idee?Gruß
-
in dem Repo:
kann ich das Paket libqt5svg5-dev nicht finden, oder ist es das gleiche wie libqt5svg5-debuginfo?
wird jetzt erfolgreich ausgeführt
Beim Aufruf von "make kommt folgende Fehlermeldung:
Code
Alles anzeigenmake cd src/ui/ && /usr/bin/qmake /home/hardy/Downloads/notepadqq-master/src/ui/ui.pro PREFIX=/usr QMAKE_CFLAGS_RELEASE=\ QMAKE_CFLAGS_DEBUG=\ QMAKE_CXXFLAGS_RELEASE=\ QMAKE_CXXFLAGS_DEBUG=\ -o Makefile WARNING: /home/hardy/Downloads/notepadqq-master/src/ui/ui.pro:22: Variable QMAKE_RPATH is deprecated; use QMAKE_LFLAGS_RPATH instead. cd src/ui/ && make -f Makefile make[1]: Entering directory '/home/hardy/Downloads/notepadqq-master/src/ui' (cd "/home/hardy/Downloads/notepadqq-master/src/ui" && rm -rf "../../out/release/lib/../appdata/editor" && cd "../editor" && make DESTDIR="../../out/release/lib/../appdata/editor") make[2]: Entering directory '/home/hardy/Downloads/notepadqq-master/src/editor' mkdir -p "../../out/release/lib/../appdata/editor" cp -r classes styles images app.js index.html init.js "../../out/release/lib/../appdata/editor"/ mkdir -p "../../out/release/lib/../appdata/editor"/libs cp -r libs/jquery "../../out/release/lib/../appdata/editor"/libs/jquery/ # Call CodeMirror makefile passing DESTDIR as absolute path, so we have no problems with cd-ing to libs make -C libs -f Makefile-codemirror DESTDIR="/home/hardy/Downloads/notepadqq-master/out/release/appdata/editor"/libs/codemirror make[3]: Entering directory '/home/hardy/Downloads/notepadqq-master/src/editor/libs' mkdir -p "/home/hardy/Downloads/notepadqq-master/out/release/appdata/editor/libs/codemirror" cd codemirror && cp -r addon keymap lib mode theme LICENSE "/home/hardy/Downloads/notepadqq-master/out/release/appdata/editor/libs/codemirror"/ cp: der Aufruf von stat für „addon“ ist nicht möglich: Datei oder Verzeichnis nicht gefunden cp: der Aufruf von stat für „keymap“ ist nicht möglich: Datei oder Verzeichnis nicht gefunden cp: der Aufruf von stat für „lib“ ist nicht möglich: Datei oder Verzeichnis nicht gefunden cp: der Aufruf von stat für „mode“ ist nicht möglich: Datei oder Verzeichnis nicht gefunden cp: der Aufruf von stat für „theme“ ist nicht möglich: Datei oder Verzeichnis nicht gefunden cp: der Aufruf von stat für „LICENSE“ ist nicht möglich: Datei oder Verzeichnis nicht gefunden Makefile-codemirror:8: recipe for target 'all' failed make[3]: *** [all] Error 1 make[3]: Leaving directory '/home/hardy/Downloads/notepadqq-master/src/editor/libs' Makefile:8: recipe for target 'all' failed make[2]: *** [all] Error 2 make[2]: Leaving directory '/home/hardy/Downloads/notepadqq-master/src/editor' Makefile:255: recipe for target 'make_editor' failed make[1]: *** [make_editor] Error 2 make[1]: Leaving directory '/home/hardy/Downloads/notepadqq-master/src/ui' Makefile:39: recipe for target 'sub-src-ui-make_default' failed make: *** [sub-src-ui-make_default] Error 2Welche Datei(n) werden mit make ausgeführt? Anscheinend ist die Ordner Struktur nicht richtig.
-
Habe mir folgende Pakete installiert:
libqt5webkit5-dev
libqt5svg5, --- libqt5svg5-dev konnte ich nicht findenQT 5.3 scheint bereits bei openSUSE 13.2 enthalten zu sein, zusätzlich habe bei Software installieren - Schema - QT 5 Development installiert
Habe mit die Files dann hier heruntergeladen:
Beim Ausführen kommt folgende Fehlermeldung
qmake kann ich leider im Yast erstmal nicht finden.
-
Hallo Zusammen,
ich würde mir gerne Notepadqq installieren.
Im Netz finde ich nur .deb packages keine rpm.Auf folgender Seite habe ich dann versucht mit Hilfe von "alien" das Packet zu konvertieren:
Leider kommt es bei der Installations des rpm's (neuere Version) zu Problemen mit Abhängigkeiten:
Coderpm -i notepadqq-0.41.0-1.i386.rpmerror: Failed dependencies: libQt5Core.so.5 is needed by notepadqq-0.41.0-1.i386 libQt5Gui.so.5 is needed by notepadqq-0.41.0-1.i386 libQt5Network.so.5 is needed by notepadqq-0.41.0-1.i386 libQt5WebKit.so.5 is needed by notepadqq-0.41.0-1.i386 libQt5WebKitWidgets.so.5 is needed by notepadqq-0.41.0-1.i386 libQt5Widgets.so.5 is needed by notepadqq-0.41.0-1.i386Welche anderen Möglichkeiten gibt es noch um das Programm zu installieren.
Gruß
overheat -
ok, habe jetzt auch den ln Befehl gefunden

Auf jeden Fall startet der Solver jetzt.Vielen Dank
-
Wie mache ich das?
-
Hallo Zusammen,
ich würde mir gerne das FEM Tool CalculiX installieren.
In folgendem Repo habe ich die Installationsdaten gefunden:
Für den PRE /POST Processor habe ich über den Yast "CGX" installiert
Für den Solver: CCX
Danach lief schon mal der CGX.
Auf der Homepage :
habe ich nach den ccx short installation guide die executable "ccx_2.7" inkopiert. Die Datei kommt von der Homepage.
Unter
sind die Verzeichnisse mit den Files "src" und "test". Ebenfalls von der Homepage.
Weiterhin habe ich folgende Ordner:
Wenn ich im Terminal ccx starte kommt folgende Fehlermeldung:Codeccx: error while loading shared libraries: libgfortran.so.2: cannot open shared object file: No such file or directory
libgfortran.so.2 kann ich im Yast nicht finden und komme jetzt nicht mehr weiter.Für Hilfe zur Installation von CalculiX wäre ich dankbar.
Gruß
overheat