Gesamter Log zu groß (~12.000 zeichen) Daher nur die letzten Zeilen, wo die fehler begonnen!
Code
Authentication requested [root] for make clean:
rm -fr *.mod.c *.mod *.o .*.cmd *.ko *~
rm .tmp_versions -fr ; rm Module.symvers -fr
cd cmd ; rm -fr *.mod.c *.mod *.o .*.cmd *.ko
cd crypto ; rm -fr *.mod.c *.mod *.o .*.cmd *.ko
cd debug ; rm -fr *.mod.c *.mod *.o .*.cmd *.ko
cd eeprom ; rm -fr *.mod.c *.mod *.o .*.cmd *.ko
cd hal/rtl8712 ; rm -fr *.mod.c *.mod *.o .*.cmd *.ko
cd io ; rm -fr *.mod.c *.mod *.o .*.cmd *.ko
cd ioctl ; rm -fr *.mod.c *.mod *.o .*.cmd *.ko
cd led ; rm -fr *.mod.c *.mod *.o .*.cmd *.ko
cd mlme ; rm -fr *.mod.c *.mod *.o .*.cmd *.ko
cd mp ; rm -fr *.mod.c *.mod *.o .*.cmd *.ko
cd os_dep/linux ; rm -fr *.mod.c *.mod *.o .*.cmd *.ko
cd os_intf ; rm -fr *.mod.c *.mod *.o .*.cmd *.ko
cd os_intf/linux ; rm -fr *.mod.c *.mod *.o .*.cmd *.ko
cd pwrctrl ; rm -fr *.mod.c *.mod *.o .*.cmd *.ko
cd recv ; rm -fr *.mod.c *.mod *.o .*.cmd *.ko
cd rf ; rm -fr *.mod.c *.mod *.o .*.cmd *.ko
cd sta_mgt ; rm -fr *.mod.c *.mod *.o .*.cmd *.ko
cd xmit; rm -fr *.mod.c *.mod *.o .*.cmd *.ko
cd efuse; rm -fr *.mod.c *.mod *.o .*.cmd *.ko
Authentication requested [root] for make driver:
make ARCH=i386 CROSS_COMPILE= -C /lib/modules/3.11.6-4-desktop/build M=/home/Computer/Downloads/rtl8712_8188_8191_8192SU_usb_linux_v2.6.6.0.20120405/driver/rtl8712_8188_8191_8192SU_usb_linux_v2.6.6.0.20120405 modules
make[1]: Entering directory `/usr/src/linux-3.11.6-4-obj/i386/desktop'
CC [M] /home/Computer/Downloads/rtl8712_8188_8191_8192SU_usb_linux_v2.6.6.0.20120405/driver/rtl8712_8188_8191_8192SU_usb_linux_v2.6.6.0.20120405/cmd/rtl871x_cmd.o
In file included from /home/Computer/Downloads/rtl8712_8188_8191_8192SU_usb_linux_v2.6.6.0.20120405/driver/rtl8712_8188_8191_8192SU_usb_linux_v2.6.6.0.20120405/cmd/rtl871x_cmd.c:23:0:
/home/Computer/Downloads/rtl8712_8188_8191_8192SU_usb_linux_v2.6.6.0.20120405/driver/rtl8712_8188_8191_8192SU_usb_linux_v2.6.6.0.20120405/include/osdep_service.h: In function ‘thread_enter’:
/home/Computer/Downloads/rtl8712_8188_8191_8192SU_usb_linux_v2.6.6.0.20120405/driver/rtl8712_8188_8191_8192SU_usb_linux_v2.6.6.0.20120405/include/osdep_service.h:393:2: error: implicit declaration of function ‘daemonize’ [-Werror=implicit-function-declaration]
daemonize("%s", "RTKTHREAD");
^
In file included from /home/Computer/Downloads/rtl8712_8188_8191_8192SU_usb_linux_v2.6.6.0.20120405/driver/rtl8712_8188_8191_8192SU_usb_linux_v2.6.6.0.20120405/include/drv_types.h:70:0,
from /home/Computer/Downloads/rtl8712_8188_8191_8192SU_usb_linux_v2.6.6.0.20120405/driver/rtl8712_8188_8191_8192SU_usb_linux_v2.6.6.0.20120405/cmd/rtl871x_cmd.c:24:
/home/Computer/Downloads/rtl8712_8188_8191_8192SU_usb_linux_v2.6.6.0.20120405/driver/rtl8712_8188_8191_8192SU_usb_linux_v2.6.6.0.20120405/include/rtl871x_cmd.h: At top level:
/home/Computer/Downloads/rtl8712_8188_8191_8192SU_usb_linux_v2.6.6.0.20120405/driver/rtl8712_8188_8191_8192SU_usb_linux_v2.6.6.0.20120405/include/rtl871x_cmd.h:107:25: error: field ‘event_tasklet’ has incomplete type
struct tasklet_struct event_tasklet;
^
In file included from /home/Computer/Downloads/rtl8712_8188_8191_8192SU_usb_linux_v2.6.6.0.20120405/driver/rtl8712_8188_8191_8192SU_usb_linux_v2.6.6.0.20120405/include/drv_types.h:72:0,
from /home/Computer/Downloads/rtl8712_8188_8191_8192SU_usb_linux_v2.6.6.0.20120405/driver/rtl8712_8188_8191_8192SU_usb_linux_v2.6.6.0.20120405/cmd/rtl871x_cmd.c:24:
/home/Computer/Downloads/rtl8712_8188_8191_8192SU_usb_linux_v2.6.6.0.20120405/driver/rtl8712_8188_8191_8192SU_usb_linux_v2.6.6.0.20120405/include/rtl871x_xmit.h:355:24: error: field ‘xmit_tasklet’ has incomplete type
struct tasklet_struct xmit_tasklet;
^
In file included from /home/Computer/Downloads/rtl8712_8188_8191_8192SU_usb_linux_v2.6.6.0.20120405/driver/rtl8712_8188_8191_8192SU_usb_linux_v2.6.6.0.20120405/include/drv_types.h:73:0,
from /home/Computer/Downloads/rtl8712_8188_8191_8192SU_usb_linux_v2.6.6.0.20120405/driver/rtl8712_8188_8191_8192SU_usb_linux_v2.6.6.0.20120405/cmd/rtl871x_cmd.c:24:
/home/Computer/Downloads/rtl8712_8188_8191_8192SU_usb_linux_v2.6.6.0.20120405/driver/rtl8712_8188_8191_8192SU_usb_linux_v2.6.6.0.20120405/include/rtl871x_recv.h:205:24: error: field ‘recv_tasklet’ has incomplete type
struct tasklet_struct recv_tasklet;
^
cc1: some warnings being treated as errors
make[4]: *** [/home/Computer/Downloads/rtl8712_8188_8191_8192SU_usb_linux_v2.6.6.0.20120405/driver/rtl8712_8188_8191_8192SU_usb_linux_v2.6.6.0.20120405/cmd/rtl871x_cmd.o] Error 1
make[3]: *** [_module_/home/Computer/Downloads/rtl8712_8188_8191_8192SU_usb_linux_v2.6.6.0.20120405/driver/rtl8712_8188_8191_8192SU_usb_linux_v2.6.6.0.20120405] Error 2
make[2]: *** [sub-make] Error 2
make[1]: *** [all] Error 2
make[1]: Leaving directory `/usr/src/linux-3.11.6-4-obj/i386/desktop'
make: *** [modules] Error 2
##################################################
Compile make driver error: 2
Please check error Mesg
##################################################
Alles anzeigen