Dann doch ein größerer Ausschnitt:
Code
make[5]: Entering directory `/root/Download/flac-1.2.1/examples/cpp/decode/file'
if g++ -DHAVE_CONFIG_H -I. -I. -I../../../.. -DFLaC__INLINE=__inline__ -DNDEBUG -I../../../.. -I./include -I../../../../include -g -O2 -MT main.o -MD -MP -MF ".deps/main.Tpo" \
-c -o main.o `test -f 'main.cpp' || echo './'`main.cpp; \
then mv -f ".deps/main.Tpo" ".deps/main.Po"; \
else rm -f ".deps/main.Tpo"; exit 1; \
fi
/bin/sh ../../../../libtool --mode=link g++ -g -O2 -o example_cpp_decode_file main.o ../../../../src/libFLAC++/libFLAC++.la ../../../../src/libFLAC/libFLAC.la -lm
mkdir .libs
g++ -g -O2 -o .libs/example_cpp_decode_file main.o ../../../../src/libFLAC++/.libs/libFLAC++.so /root/Download/flac-1.2.1/src/libFLAC/.libs/libFLAC.so ../../../../src/libFLAC/.libs/libFLAC.so -lm
creating example_cpp_decode_file
make[5]: Leaving directory `/root/Download/flac-1.2.1/examples/cpp/decode/file'
make[5]: Entering directory `/root/Download/flac-1.2.1/examples/cpp/decode'
make[5]: Nothing to be done for `all-am'.
make[5]: Leaving directory `/root/Download/flac-1.2.1/examples/cpp/decode'
make[4]: Leaving directory `/root/Download/flac-1.2.1/examples/cpp/decode'
Making all in encode
make[4]: Entering directory `/root/Download/flac-1.2.1/examples/cpp/encode'
Making all in file
make[5]: Entering directory `/root/Download/flac-1.2.1/examples/cpp/encode/file'
if g++ -DHAVE_CONFIG_H -I. -I. -I../../../.. -DFLaC__INLINE=__inline__ -DNDEBUG -I../../../.. -I./include -I../../../../include -g -O2 -MT main.o -MD -MP -MF ".deps/main.Tpo" \
-c -o main.o `test -f 'main.cpp' || echo './'`main.cpp; \
then mv -f ".deps/main.Tpo" ".deps/main.Po"; \
else rm -f ".deps/main.Tpo"; exit 1; \
fi
main.cpp: In function ‘int main(int, char**)’:
main.cpp:75: error: ‘memcmp’ was not declared in this scope
make[5]: *** [main.o] Error 1
make[5]: Leaving directory `/root/Download/flac-1.2.1/examples/cpp/encode/file'
make[4]: *** [all-recursive] Error 1
make[4]: Leaving directory `/root/Download/flac-1.2.1/examples/cpp/encode'
make[3]: *** [all-recursive] Error 1
make[3]: Leaving directory `/root/Download/flac-1.2.1/examples/cpp'
make[2]: *** [all-recursive] Error 1
make[2]: Leaving directory `/root/Download/flac-1.2.1/examples'
make[1]: *** [all-recursive] Error 1
make[1]: Leaving directory `/root/Download/flac-1.2.1'
make: *** [all] Error 2
Alles anzeigen
Editier: Admin → Linuxsusefan
Verwende bitte für derartige Ausgaben Code-Tags! Wie das geht und was es sonst so zu beachten gibt, findest u.a. im Beitrag → Wichtig: Vor dem Posten bitte erst Lesen!