Lässt sich nicht kompilieren:
Code
xxxxxx@linux-ugfg:~> cd /xxxxxx/rpmbuild/SRPMS/
bash: cd: /xxxxxx/rpmbuild/SRPMS/: No such file or directory
xxxxxx@linux-ugfg:~> cd /home/xxxxxx/rpmbuild/SRPMS/
xxxxxx@linux-ugfg:~/rpmbuild/SRPMS> rpmbuild --rebuild broad
error: cannot open broad: No such file or directory
xxxxxx@linux-ugfg:~/rpmbuild/SRPMS> rpmbuild --rebuild broadcom-wl-6.30.223.271-11.324.src.rpm
Installing broadcom-wl-6.30.223.271-11.324.src.rpm
warning: line 63: It's not recommended to have unversioned Obsoletes: Obsoletes: broadcom-wl-kmp-trace
warning: line 63: It's not recommended to have unversioned Obsoletes: Obsoletes: broadcom-wl-kmp-desktop
warning: line 63: It's not recommended to have unversioned Obsoletes: Obsoletes: broadcom-wl-kmp-xen
Executing(%prep): /bin/sh -e /var/tmp/rpm-tmp.Lu6wip
+ umask 022
+ cd /home/xxxxxx/rpmbuild/BUILD
+ cd /home/xxxxxx/rpmbuild/BUILD
+ rm -rf broadcom-wl-6.30.223.271
+ /usr/bin/mkdir -p broadcom-wl-6.30.223.271
+ cd broadcom-wl-6.30.223.271
+ /usr/bin/gzip -dc /home/xxxxxx/rpmbuild/SOURCES/hybrid-v35_64-nodebug-pcoem-6_30_223_271.tar.gz
+ /usr/bin/tar -xof -
+ STATUS=0
+ '[' 0 -ne 0 ']'
+ /usr/bin/chmod -Rf a+rX,u+w,g-w,o-w .
+ /usr/bin/cat /home/xxxxxx/rpmbuild/SOURCES/broadcom-sta-6.30.223.141-eth-to-wlan.patch
+ /usr/bin/patch -p1 -s --fuzz=0 --no-backup-if-mismatch
+ /usr/bin/cat /home/xxxxxx/rpmbuild/SOURCES/broadcom-sta-6.30.223.141-gcc.patch
+ /usr/bin/patch -p1 -s --fuzz=0 --no-backup-if-mismatch
+ /usr/bin/cat /home/xxxxxx/rpmbuild/SOURCES/broadcom-sta-6.30.223.141-makefile.patch
+ /usr/bin/patch -p1 -s --fuzz=0 --no-backup-if-mismatch
+ /usr/bin/cat /home/xxxxxx/rpmbuild/SOURCES/broadcom-sta-6.30.223.248-r3-Wno-date-time.patch
+ /usr/bin/patch -p1 -s --fuzz=0 --no-backup-if-mismatch
+ /usr/bin/cat /home/xxxxxx/rpmbuild/SOURCES/broadcom-sta-6.30.223.271-r1-linux-3.18.patch
+ /usr/bin/patch -p1 -s --fuzz=0 --no-backup-if-mismatch
+ /usr/bin/cat /home/xxxxxx/rpmbuild/SOURCES/broadcom-sta-6.30.223.271-r2-linux-4.3-v2.patch
+ /usr/bin/patch -p1 -s --fuzz=0 --no-backup-if-mismatch
+ /usr/bin/cat /home/xxxxxx/rpmbuild/SOURCES/broadcom-sta-6.30.223.271-r4-linux-4.7.patch
+ /usr/bin/patch -p1 -s --fuzz=0 --no-backup-if-mismatch
+ /usr/bin/cat /home/xxxxxx/rpmbuild/SOURCES/broadcom-sta-6.30.223.271-r4-linux-4.8.patch
+ /usr/bin/patch -p1 -s --fuzz=0 --no-backup-if-mismatch
+ /usr/bin/cat /home/xxxxxx/rpmbuild/SOURCES/broadcom-wl.linux-4.11.patch
+ /usr/bin/patch -p1 -s --fuzz=0 --no-backup-if-mismatch
+ /usr/bin/cat /home/xxxxxx/rpmbuild/SOURCES/broadcom-wl.linux-4.12.patch
+ /usr/bin/patch -p1 -s --fuzz=0 --no-backup-if-mismatch
+ /usr/bin/cat /home/xxxxxx/rpmbuild/SOURCES/broadcom-wl.linux-4.14.patch
+ /usr/bin/patch -p1 -s --fuzz=0 --no-backup-if-mismatch
+ /usr/bin/cat /home/xxxxxx/rpmbuild/SOURCES/broadcom-wl.linux-4.15.patch
+ /usr/bin/patch -p1 -s --fuzz=0 --no-backup-if-mismatch
+ /usr/bin/cat /home/xxxxxx/rpmbuild/SOURCES/broadcom-wl.linux-5.1.patch
+ /usr/bin/patch -p1 -s --fuzz=0 --no-backup-if-mismatch
+ RPM_EC=0
++ jobs -p
+ exit 0
Executing(%build): /bin/sh -e /var/tmp/rpm-tmp.f3wLSo
+ umask 022
+ cd /home/xxxxxx/rpmbuild/BUILD
+ /usr/bin/rm -rf /home/xxxxxx/rpmbuild/BUILDROOT/broadcom-wl-6.30.223.271-11.324.x86_64
++ dirname /home/xxxxxx/rpmbuild/BUILDROOT/broadcom-wl-6.30.223.271-11.324.x86_64
+ /usr/bin/mkdir -p /home/xxxxxx/rpmbuild/BUILDROOT
+ /usr/bin/mkdir /home/xxxxxx/rpmbuild/BUILDROOT/broadcom-wl-6.30.223.271-11.324.x86_64
+ cd broadcom-wl-6.30.223.271
+ sed -i 's/\r$//' lib/LICENSE.txt
+ set -- lib Makefile src
+ mkdir source
+ mv lib Makefile src source/
+ mkdir obj
+ export 'EXTRA_CFLAGS=-DVERSION=\"6.30.223.271\"'
+ EXTRA_CFLAGS='-DVERSION=\"6.30.223.271\"'
+ for flavor in default
+ rm -rf obj/default
+ cp -r source obj/default
+ make -C /usr/src/linux-obj/x86_64/default modules M=/home/xxxxxx/rpmbuild/BUILD/broadcom-wl-6.30.223.271/obj/default V=1
make: Verzeichnis „/usr/src/linux-5.6.12-1-obj/x86_64/default“ wird betreten
make -C /usr/src/linux-5.6.12-1-obj/x86_64/default -f /usr/src/linux-5.6.12-1/Makefile modules
test -e include/generated/autoconf.h -a -e include/config/auto.conf || ( \
echo >&2; \
echo >&2 " ERROR: Kernel configuration is invalid."; \
echo >&2 " include/generated/autoconf.h or include/config/auto.conf are missing.";\
echo >&2 " Run 'make oldconfig && make prepare' on kernel src to fix it."; \
echo >&2 ; \
/bin/false)
make -f /usr/src/linux-5.6.12-1/scripts/Makefile.build obj=/home/xxxxxx/rpmbuild/BUILD/broadcom-wl-6.30.223.271/obj/default \
single-build= \
need-builtin=1 need-modorder=1
CFG80211 API is prefered for this kernel version
Using CFG80211 API
gcc -Wp,-MD,/home/xxxxxx/rpmbuild/BUILD/broadcom-wl-6.30.223.271/obj/default/src/shared/.linux_osl.o.d -nostdinc -isystem /usr/lib64/gcc/x86_64-suse-linux/9/include -I/usr/src/linux-5.6.12-1/arch/x86/include -I./arch/x86/include/generated -I/usr/src/linux-5.6.12-1/include -I./include -I/usr/src/linux-5.6.12-1/arch/x86/include/uapi -I./arch/x86/include/generated/uapi -I/usr/src/linux-5.6.12-1/include/uapi -I./include/generated/uapi -include /usr/src/linux-5.6.12-1/include/linux/kconfig.h -include /usr/src/linux-5.6.12-1/include/linux/compiler_types.h -D__KERNEL__ -Wall -Wundef -Werror=strict-prototypes -Wno-trigraphs -fno-strict-aliasing -fno-common -fshort-wchar -fno-PIE -Werror=implicit-function-declaration -Werror=implicit-int -Wno-format-security -std=gnu89 -mno-sse -mno-mmx -mno-sse2 -mno-3dnow -mno-avx -m64 -falign-jumps=1 -falign-loops=1 -mno-80387 -mno-fp-ret-in-387 -mpreferred-stack-boundary=3 -mskip-rax-setup -mtune=generic -mno-red-zone -mcmodel=kernel -DCONFIG_X86_X32_ABI -DCONFIG_AS_CFI=1 -DCONFIG_AS_CFI_SIGNAL_FRAME=1 -DCONFIG_AS_CFI_SECTIONS=1 -DCONFIG_AS_SSSE3=1 -DCONFIG_AS_AVX=1 -DCONFIG_AS_AVX2=1 -DCONFIG_AS_AVX512=1 -DCONFIG_AS_SHA1_NI=1 -DCONFIG_AS_SHA256_NI=1 -DCONFIG_AS_ADX=1 -Wno-sign-compare -fno-asynchronous-unwind-tables -mindirect-branch=thunk-extern -mindirect-branch-register -fno-jump-tables -fno-delete-null-pointer-checks -Wno-frame-address -Wno-format-truncation -Wno-format-overflow -Wno-address-of-packed-member -O2 --param=allow-store-data-races=0 -Wframe-larger-than=2048 -fstack-protector-strong -Wno-unused-but-set-variable -Wimplicit-fallthrough -Wno-unused-const-variable -fno-var-tracking-assignments -g -gdwarf-4 -pg -mrecord-mcount -mfentry -DCC_USING_FENTRY -fno-inline-functions-called-once -flive-patching=inline-clone -Wdeclaration-after-statement -Wvla -Wno-pointer-sign -Wno-stringop-truncation -fno-strict-overflow -fno-merge-all-constants -fmerge-constants -fno-stack-check -fconserve-stack -Werror=date-time -Werror=incompatible-pointer-types -Werror=designated-init -fmacro-prefix-map=/usr/src/linux-5.6.12-1/= -fcf-protection=none -Wno-packed-not-aligned -DUSE_CFG80211 -I/home/xxxxxx/rpmbuild/BUILD/broadcom-wl-6.30.223.271/obj/default/src/include -I/home/xxxxxx/rpmbuild/BUILD/broadcom-wl-6.30.223.271/obj/default/src/common/include -I/home/xxxxxx/rpmbuild/BUILD/broadcom-wl-6.30.223.271/obj/default/src/wl/sys -I/home/xxxxxx/rpmbuild/BUILD/broadcom-wl-6.30.223.271/obj/default/src/wl/phy -I/home/xxxxxx/rpmbuild/BUILD/broadcom-wl-6.30.223.271/obj/default/src/wl/ppr/include -I/home/xxxxxx/rpmbuild/BUILD/broadcom-wl-6.30.223.271/obj/default/src/shared/bcmwifi/include -Wno-date-time -Wno-date-time -DMODULE -DKBUILD_BASENAME='"linux_osl"' -DKBUILD_MODNAME='"wl"' -c -o /home/xxxxxx/rpmbuild/BUILD/broadcom-wl-6.30.223.271/obj/default/src/shared/linux_osl.o /home/xxxxxx/rpmbuild/BUILD/broadcom-wl-6.30.223.271/obj/default/src/shared/linux_osl.c
/home/xxxxxx/rpmbuild/BUILD/broadcom-wl-6.30.223.271/obj/default/src/shared/linux_osl.c: In Funktion »osl_reg_map«:
/home/xxxxxx/rpmbuild/BUILD/broadcom-wl-6.30.223.271/obj/default/src/shared/linux_osl.c:949:10: Fehler: Implizite Deklaration der Funktion »ioremap_nocache«; meinten Sie »ioremap_cache«? [-Werror=implicit-function-declaration]
949 | return (ioremap_nocache((unsigned long)pa, (unsigned long)size));
| ^~~~~~~~~~~~~~~
| ioremap_cache
/home/xxxxxx/rpmbuild/BUILD/broadcom-wl-6.30.223.271/obj/default/src/shared/linux_osl.c:949:10: Warnung: Rückgabe von »int« aus einer Funktion mit Rückgabetyp »void *« wandelt eine Zahl in einen Zeiger um, ohne explizite Typkonvertierung [-Wint-conversion]
949 | return (ioremap_nocache((unsigned long)pa, (unsigned long)size));
| ~^~~~~~~~~~~~~~~~~~~~~~~~~~~~~~~~~~~~~~~~~~~~~~~~~~~~~~~~
cc1: Einige Warnungen werden als Fehler behandelt
make[2]: *** [/usr/src/linux-5.6.12-1/scripts/Makefile.build:269: /home/xxxxxx/rpmbuild/BUILD/broadcom-wl-6.30.223.271/obj/default/src/shared/linux_osl.o] Fehler 1
make[1]: *** [/usr/src/linux-5.6.12-1/Makefile:1698: /home/xxxxxx/rpmbuild/BUILD/broadcom-wl-6.30.223.271/obj/default] Fehler 2
make: *** [../../../linux-5.6.12-1/Makefile:180: sub-make] Fehler 2
make: Verzeichnis „/usr/src/linux-5.6.12-1-obj/x86_64/default“ wird verlassen
error: Bad exit status from /var/tmp/rpm-tmp.f3wLSo (%build)
RPM build errors:
line 63: It's not recommended to have unversioned Obsoletes: Obsoletes: broadcom-wl-kmp-trace
line 63: It's not recommended to have unversioned Obsoletes: Obsoletes: broadcom-wl-kmp-desktop
line 63: It's not recommended to have unversioned Obsoletes: Obsoletes: broadcom-wl-kmp-xen
Bad exit status from /var/tmp/rpm-tmp.f3wLSo (%build)
xxxxxx@linux-ugfg:~/rpmbuild/SRPMS>
Alles anzeigen
xxxxxx steht für meinen User-Namen!